{"text_format":"1","workbook":"xlsx","n_sheets":7,"sheets":["Instructions","Calculator","Ineligible Vehicles for EVM","Data","Results","PHEV_Calcs","Passenger EV Fuel Efficiency"],"not_rendered":{"charts":5,"images":103,"macros":1,"external_links":0,"defined_names":31,"comments":4,"pivot_tables":0},"unopened":[],"bounds":{"document_bytes":16777216,"sheet_cells":100000,"rows_first":2000,"rows_last":500,"rows_between":2000,"halvings":0,"cell_chars":16384,"cell_head_chars":4096},"cells_cut":0,"cells_raw":0,"read":"whole","date_system":"1900"}

{"sheet":"Instructions","index":0,"n_rows":52,"n_cols":15,"rows_kept":52,"cut":false,"hidden":false,"merged":[]}
[]
[null,null,null,null,null,null,"Electric Vehicle Savings Calculator"]
[]
[]
["Welcome to the Electric Vehicle Savings Calculator"]
[]
["This calculator provides a resource to estimate the cost saving and greenhouse gas (GHG) emission reduction potential of purchasing an electric vehicle (EV) "]
["in place of a traditional internal combustion engine (ICE) vehicle within the Province of Alberta. The calculator's financial analysis includes estimated values for "]
["incentives available through the",null,null,"Electric Vehicles for Municipalities (EVM) program.",null,null,null,null,null,null,"Other rebates may be entered into the \"Additional Rebates\" field such as "]
["the Government of Canada's Zero-emission Vehicle Incentive Program."]
[]
["Instructions for Use"]
[]
["In the \"Calculator\" tab, please enter information about your vehicle usage into all green entry fields at the top and then select your vehicle preferences."]
["The vehicle stats will populate automatically. Once complete, click the \"Click Here to Compute the Savings\" button (top right-hand corner) to compute a cost and "]
["GHG comparision of the vehicles. Review your results below. "]
[]
["If your desired ICE vehicle is not found in the list, use the \"Other Vehicle\" option at the bottom of the list and enter the vehicle information in the green entry fields below."]
["Click the \"Reset\" button to start over."]
[]
{"$rows_left_out":33}
{"sheet":"Calculator","index":1,"n_rows":44,"n_cols":11,"rows_kept":44,"cut":false,"hidden":false,"merged":[]}
[]
["STEP 1. \nEnter Usage Data:"]
["Annual Distance Driven (km):",20000,"km per year"]
["Approx. # of Km Driven in Gas-Mode (for PHEVs only):",8400,"km per year"]
["Price of Fuel:",1.5,"per Litre"]
["Electricity Rate:",0.15,"per kWh"]
["Lifetime Use of New Vehicle:",10,"years"]
["Additional Rebate Value:",0]
[]
[null,"Electric Vehicle",null,null,"Internal Combustion Engine Vehicle"]
[]
["STEP 2. \nChoose Your Electric Vehicle:","<SELECT THIS CELL AND THEN \nCHOOSE VEHICLE FROM DROPDOWN LIST>",null,"STEP 3. \nChoose Your ICE Vehicle:","<SELECT THIS CELL AND THEN \nCHOOSE VEHICLE FROM DROPDOWN LIST>"]
[]
["Type of Vehicle:",{"$f":"VLOOKUP(B12, Data!$A$2:$I$37,2,FALSE)","v":{"$error":"#N/A"}},null,"Type of Vehicle:",{"$f":"VLOOKUP(E12, Data!$P$2:$T$72,2,FALSE)","v":{"$error":"#N/A"}}]
["Purchase Price:",{"$f":"VLOOKUP(B12, Data!$A$2:$I$37,3,FALSE)","v":{"$error":"#N/A"}},null,"Purchase Price:",{"$f":"VLOOKUP(E12, Data!$P$2:$T$72,3,FALSE)","v":{"$error":"#N/A"}}]
["Electricity Consumption:",{"$f":"VLOOKUP(B12, Data!$A$2:$I$37,4,FALSE)","v":{"$error":"#N/A"}},"kWh per 100 km","Gas Consumption:",{"$f":"VLOOKUP(E12, Data!$P$2:$T$72,4,FALSE)","v":{"$error":"#N/A"}},"L per 100 km (combined City and Hwy)"]
["Gas Consumption:",{"$f":"VLOOKUP(B12, Data!$A$2:$I$37,7,FALSE)","v":{"$error":"#N/A"}},"L per 100 km (PHEVs only)"]
["EVM Rebate:",{"$f":"VLOOKUP(B12, Data!$A$2:$I$37,8,FALSE)","v":{"$error":"#N/A"}},null,"Other Vehicle:"," "]
["Electric Range:",{"$f":"VLOOKUP(B12, Data!$A$2:$I$37,9,FALSE)","v":{"$error":"#N/A"}},"km","Purchase Price:"," "]
["Battery Capacity",{"$f":"VLOOKUP(B12, Data!$A$2:$I$37,5,FALSE)","v":{"$error":"#N/A"}},"kWh","Litres Consumed per 100 km:"," ","L per 100 km (combined City and Hwy)"]
{"$rows_left_out":25}
{"sheet":"Ineligible Vehicles for EVM","index":2,"n_rows":25,"n_cols":1,"rows_kept":25,"cut":false,"hidden":false,"merged":[]}
["The following vehicle makes are ineligible for EVM program rebates and do not appear in the calculator list:"]
[]
["Acura"]
["Alfa Romeo"]
["Aston Martin"]
["Audi"]
["Bentley"]
["BMW"]
["Bugatti"]
["Buick"]
["Cadillac"]
["Fiat"]
["Genesis"]
["Infiniti"]
["Jaguar"]
["Lamborghini"]
["Land Rover"]
["Lexus"]
["Lincoln"]
["Maserati"]
{"$rows_left_out":6}
{"sheet":"Data","index":3,"n_rows":72,"n_cols":23,"rows_kept":72,"cut":false,"hidden":true,"merged":[]}
["Electric Vehicles","Type","Purchase Price","kWh/100km","Battery Capacity (kWh)","CO2 (g/km)","L/100km","EVM Rebate","Electric Range (km)"," Annual Maintenance Costs ","PHEV Annual GHGs (tCO2e) ","PHEV Annual Fuel Costs ","Pictures",null,null,"ICE Vehicles","Type","Purchase Price","L/100km","CO2 (g/km)"," Annual Maintenance Costs","Pictures"]
["<CHOOSE FROM LIST>","--","--","--","--","--","--","--","--",null,null,null,null,{"$f":"A2","v":"<CHOOSE FROM LIST>"},null,"<CHOOSE FROM LIST>","--","--","--","--",null,null,"<CHOOSE FROM LIST>"]
["CHEVROLET VOLT (2019)","PHEV",41381,19.899999999999999,18.399999999999999,32,5.6,{"$f":"IF(E3<15,7000,14000)","v":14000},85,{"$f":"0.03*Calculator!$B$3*1.27","v":762},{"$f":"PHEV_Calcs!M12","v":2.2850766399999998},{"$f":"PHEV_Calcs!N12","v":655},null,"CHEVROLET VOLT (2019)",null,"CHEVROLET COLORADO","Pickup Truck",27948,10.9,257,{"$f":"0.061*1.27*Calculator!$B$3","v":1549.3999999999999},null,{"$f":"P3","v":"CHEVROLET COLORADO"}]
["CHRYSLER PACIFICA HYBRID","PHEV",50234,25.8,16,74,8,{"$f":"IF(E4<15,7000,14000)","v":14000},51,{"$f":"0.03*Calculator!$B$3*1.27","v":762},{"$f":"PHEV_Calcs!M13","v":3.0865958399999998},{"$f":"PHEV_Calcs!N13","v":1094},null,"CHRYSLER PACIFICA HYBRID",null,"CHEVROLET CRUZE (2019)","Compact Sedan",21000,7.3,172,{"$f":"0.061*1.27*Calculator!$B$3","v":1549.3999999999999},null,{"$f":"P4","v":"CHEVROLET CRUZE (2019)"}]
["FORD ESCAPE PLUG-IN","PHEV",41199,20.2,14.4,48,5.8,7000,60,{"$f":"0.03*Calculator!$B$3*1.27","v":762},{"$f":"PHEV_Calcs!M14","v":2.3636788399999999},{"$f":"PHEV_Calcs!N14","v":795},null,"FORD ESCAPE PLUG-IN",null,"CHEVROLET EQUINOX","Sport Utility Vehicle",27198,8.4,198,{"$f":"0.061*1.27*Calculator!$B$3","v":1549.3999999999999},null,"CHEVROLET EQUINOX"]
["FORD FUSION PHEV (2020)","PHEV",50692,20.5,9,61,5.6,7000,42,{"$f":"0.03*Calculator!$B$3*1.27","v":762},{"$f":"PHEV_Calcs!M15","v":2.4137428999999999},{"$f":"PHEV_Calcs!N15","v":957},null,"FORD FUSION PHEV (2020)",null,"CHEVROLET IMPALA (2020)","Full Size Sedan",35914,10.9,255,{"$f":"0.061*1.27*Calculator!$B$3","v":1549.3999999999999},null,"CHEVROLET IMPALA (2020)"]
["HONDA CLARITY PLUG-IN (2021)","PHEV",44505,19,17,36,5.6,14000,77,{"$f":"0.03*Calculator!$B$3*1.27","v":762},{"$f":"PHEV_Calcs!M16","v":2.231026},{"$f":"PHEV_Calcs!N16","v":746},null,"HONDA CLARITY PLUG-IN (2021)",null,"CHEVROLET MALIBU","Mid-Size Sedan",25248,7.5,175,{"$f":"0.061*1.27*Calculator!$B$3","v":1549.3999999999999},null,"CHEVROLET MALIBU"]
["HYUNDAI IONIQ PLUG-IN","PHEV",44999,17.399999999999999,8.9,46,4.5,7000,47,{"$f":"0.03*Calculator!$B$3*1.27","v":762},{"$f":"PHEV_Calcs!M17","v":2.0005084799999997},{"$f":"PHEV_Calcs!N17","v":684},null,"HYUNDAI IONIQ PLUG-IN",null,"CHEVROLET SILVERADO","Pickup Truck",30998,13.8,325,{"$f":"0.061*1.27*Calculator!$B$3","v":1549.3999999999999},null,"CHEVROLET SILVERADO"]
["HYUNDAI SONATA PLUG-IN (2019)","PHEV",43600,20.9,9.8000000000000007,62,6,7000,45,{"$f":"0.03*Calculator!$B$3*1.27","v":762},{"$f":"PHEV_Calcs!M18","v":2.4498526799999998},{"$f":"PHEV_Calcs!N18","v":836},null,"HYUNDAI SONATA PLUG-IN (2019)",null,"CHEVROLET SPARK ","Sub-Compact Sedan",9998,7,165,{"$f":"0.061*1.27*Calculator!$B$3","v":1549.3999999999999},null,"CHEVROLET SPARK "]
["HYUNDAI SANTA FE PLUG-IN","PHEV",36353.699999999997,27.5,13.8,69,7.2,{"$f":"IF(E10<15,7000,14000)","v":7000},50,{"$f":"0.03*Calculator!$B$3*1.27","v":762},{"$f":"PHEV_Calcs!M19","v":3.1689486000000002},{"$f":"PHEV_Calcs!N19","v":1081},null,"HYUNDAI SANTA FE PLUG-IN",null,"CHEVROLET SUBURBAN","Sport Utility Vehicle",59398,13.2,309,{"$f":"0.061*1.27*Calculator!$B$3","v":1549.3999999999999},null,{"$f":"P10","v":"CHEVROLET SUBURBAN"}]
["HYUNDAI TUCSON PLUG-IN","PHEV",41051,25.9,13.8,62,6.7,7000,53,{"$f":"0.03*Calculator!$B$3*1.27","v":762},{"$f":"PHEV_Calcs!M20","v":2.9753744000000002},{"$f":"PHEV_Calcs!N20","v":994},null,"HYUNDAI TUCSON PLUG-IN",null,"CHEVROLET TAHOE","Sport Utility Vehicle",56398,13.2,309,{"$f":"0.061*1.27*Calculator!$B$3","v":1549.3999999999999},null,"CHEVROLET TAHOE"]
["GRAND CHEROKEE 4XE","PHEV",75195,36,17,110,10,14000,42,{"$f":"0.03*Calculator!$B$3*1.27","v":762},{"$f":"PHEV_Calcs!M21","v":4.2166416},{"$f":"PHEV_Calcs!N21","v":1516},null,"GRAND CHEROKEE 4XE"]
["WRANGLER 4XE","PHEV",55114,42.2,17,143,11.7,14000,35,{"$f":"0.03*Calculator!$B$3*1.27","v":762},{"$f":"PHEV_Calcs!M22","v":4.9502870400000001},{"$f":"PHEV_Calcs!N22","v":1814},null,"WRANGLER 4XE"]
["KIA NIRO PLUG-IN","PHEV",34595,19.7,8.9,56,5.0999999999999996,7000,42,{"$f":"0.03*Calculator!$B$3*1.27","v":762},{"$f":"PHEV_Calcs!M23","v":2.2662909},{"$f":"PHEV_Calcs!N23","v":783},null,"KIA NIRO PLUG-IN",null,"CHRYSLER PACIFICA","Minivan",34560,10.6,249,{"$f":"0.061*1.27*Calculator!$B$3","v":1549.3999999999999},null,"CHRYSLER PACIFICA"]
["KIA OPTIMA PLUG-IN (2020)","PHEV",43995,20.7,9.8000000000000007,60,5.7,7000,45,{"$f":"0.03*Calculator!$B$3*1.27","v":762},{"$f":"PHEV_Calcs!M24","v":2.4383026799999996},{"$f":"PHEV_Calcs!N24","v":947},null,"KIA OPTIMA PLUG-IN (2020)",null,"CHRYSLER GRAND CARAVAN","Minivan",36339,10.6,249,{"$f":"0.061*1.27*Calculator!$B$3","v":1549.3999999999999},null,"CHRYSLER GRAND CARAVAN"]
["KIA SORENTO PLUG-IN","PHEV",46405,26.4,14,65,6.9,7000,51,{"$f":"0.03*Calculator!$B$3*1.27","v":762},{"$f":"PHEV_Calcs!M25","v":3.0387974399999997},{"$f":"PHEV_Calcs!N25","v":1019},null,"KIA SORENTO PLUG-IN",null,"FORD ESCAPE","Sport Utility Vehicle",27799,9.1,213,{"$f":"0.061*1.27*Calculator!$B$3","v":1549.3999999999999},null,"FORD ESCAPE"]
["MINI COOPER SE COUNTRYMAN ALL4","PHEV",44590,28.4,8,109,8,7000,29,{"$f":"0.03*Calculator!$B$3*1.27","v":762},{"$f":"PHEV_Calcs!M26","v":3.3847864799999998},{"$f":"PHEV_Calcs!N26","v":1367},null,"MINI COOPER SE COUNTRYMAN ALL4",null,"FORD F-150","Pickup Truck",33429,11.7,274,{"$f":"0.061*1.27*Calculator!$B$3","v":1549.3999999999999},null,"FORD F-150"]
["MITSUBISHI OUTLANDER (PHEV)","PHEV",44198,28.2,13.8,103,9.1,7000,39,{"$f":"0.03*Calculator!$B$3*1.27","v":762},{"$f":"PHEV_Calcs!M27","v":3.4575999999999998},{"$f":"PHEV_Calcs!N27","v":1318},null,"MITSUBISHI OUTLANDER (PHEV)",null,"FORD FIESTA (2019)","Sub-Compact Sedan",15800,7.6,178,{"$f":"0.061*1.27*Calculator!$B$3","v":1549.3999999999999},null,"FORD FIESTA (2019)"]
["SUBARU CROSSTREK HYBRID","PHEV",42595,23.5,8.8000000000000007,94,6.7,7000,27,{"$f":"0.03*Calculator!$B$3*1.27","v":762},{"$f":"PHEV_Calcs!M28","v":2.7932505000000001},{"$f":"PHEV_Calcs!N28","v":1075},null,"SUBARU CROSSTREK HYBRID",null,"FORD FLEX (2020)","Sport Utility Vehicle",29649,12.7,298,{"$f":"0.061*1.27*Calculator!$B$3","v":1549.3999999999999},null,"FORD FLEX (2020)"]
["TOYOTA PRIUS PRIME","PHEV",33550,15.8,8.8000000000000007,49,4.3,7000,40,{"$f":"0.03*Calculator!$B$3*1.27","v":762},{"$f":"PHEV_Calcs!M29","v":1.8414927200000002},{"$f":"PHEV_Calcs!N29","v":660},null,"TOYOTA PRIUS PRIME",null,"FORD FUSION (2020)","Mid-Size Sedan",28789,8.6999999999999993,203,{"$f":"0.061*1.27*Calculator!$B$3","v":1549.3999999999999},null,"FORD FUSION (2020)"]
{"$rows_left_out":53}
{"sheet":"Results","index":4,"n_rows":57,"n_cols":14,"rows_kept":57,"cut":false,"hidden":true,"merged":[]}
[null,null,null,null,null,null,null,null,null,null,"Chart Preparation - Cost Analysis"]
[null,"Results:",null,null,null,"Results:",null,null,null,null,null,"Year"]
[null,"GHG Emissions:",{"$f":"IFERROR(IF(Calculator!B14 = \"PHEV\",VLOOKUP(Calculator!B12, Data!$A$2:$L$100,11,FALSE),(Calculator!B3*(Calculator!B16/100) * 0.00057)),0)","v":0},"tCO2e per year",null,"GHG Emissions:",{"$f":"IFERROR(IF(Calculator!$E$12 = \"--OTHER VEHICLE (fill out info below)--\",Calculator!B3 * (Calculator!E20/100) * 0.0023,Calculator!B3 * (Calculator!E16/100) * 0.0023),0)","v":0},"tCO2e per year",null,null,"From:",1,{"$f":"INDEX($A$28:$A$57,MATCH($L$3,$A$28:$A$57,0)):INDEX($A$28:$A$57,MATCH(Calculator!$B$7,$A$28:$A$57,0))","v":{"$error":"#VALUE!"}}]
[null,"Cost to refuel:",{"$f":"IFERROR(IF(Calculator!B14=\"PHEV\",VLOOKUP(Calculator!B12, Data!$A$2:$L$100,12,FALSE),(Calculator!B6*(Calculator!B16/100) *Calculator!B3)),0)","v":0},"per year",null,"Cost to refuel:",{"$f":"IFERROR(IF(Calculator!$E$12 = \"--OTHER VEHICLE (fill out info below)--\", Calculator!B5 * (Calculator!E20/100) * Calculator!B3,Calculator!B5 * (Calculator!E16/100) * Calculator!B3),0)","v":0},"per year",null,null,"To:",null,{"$f":"INDEX($B$28:$B$57,MATCH($L$3,$A$28:$A$57,0)):INDEX($B$28:$B$57,MATCH(Calculator!$B$7,$A$28:$A$57,0))","v":{"$error":"#VALUE!"}},{"$f":"INDEX($C$28:$C$57,MATCH($L$3,$A$28:$A$57,0)):INDEX($C$28:$C$57,MATCH(Calculator!$B$7,$A$28:$A$57,0))","v":{"$error":"#VALUE!"}}]
[null,"Maintenance Costs: ",{"$f":"IFERROR(VLOOKUP(Calculator!B12, Data!$A$2:$L$100,10,FALSE),0)","v":0},"per year",null,"Maintenance Costs: ",{"$f":"IFERROR(VLOOKUP(Calculator!E12, Data!$P$2:$U$100,6,FALSE),0)","v":0},"per year",null,null,null,null,{"$f":"INDEX($D$28:$D$57,MATCH($L$3,$A$28:$A$57,0)):INDEX($D$28:$D$57,MATCH(Calculator!$B$7,$A$28:$A$57,0))","v":{"$error":"#VALUE!"}},{"$f":"INDEX($E$28:$E$57,MATCH($L$3,$A$28:$A$57,0)):INDEX($E$28:$E$57,MATCH(Calculator!$B$7,$A$28:$A$57,0))","v":{"$error":"#VALUE!"}}]
[null,null,null,null,null,"Purchase Price:",{"$f":"IFERROR(IF(Calculator!$E$12 = \"--OTHER VEHICLE (fill out info below)--\",Calculator!E19,Calculator!E15),0)","v":0}]
[null,null,null,"Overall Fuel Cost Savings:",{"$f":"G4-C4","v":0},"per year"]
[null,null,null,null,null,null,null,null,null,null,"EV:",{"$f":"Calculator!$B$12","v":"<SELECT THIS CELL AND THEN \nCHOOSE VEHICLE FROM DROPDOWN LIST>"}]
[null,null,null,"GHG Savings:",{"$f":" G3 - C3","v":0},"tCO2e per year",null,null,null,null,"ICEV:",{"$f":"IF(Calculator!E12 = \"--OTHER VEHICLE (fill out info below)--\", Calculator!E18,Calculator!E12)","v":"<SELECT THIS CELL AND THEN \nCHOOSE VEHICLE FROM DROPDOWN LIST>"}]
[]
[null,null,null,"Maintenance Savings:",{"$f":"IFERROR(G5 - C5,0)","v":0},"per year"]
[]
[null,null,null,"Purchase Price for EV:",{"$f":"IFERROR(Calculator!B15,0)","v":0}]
[null,null,null,"Purchase Price After All Rebates:",{"$f":"IFERROR(IF(Calculator!K26 = TRUE, E13 - Calculator!B8,E13 - Calculator!B18 - Calculator!B8),0)","v":0}]
[null,null,null,"Capital Cost Difference Between EV and ICEV:",{"$f":"IFERROR(G6 - E14,0)","v":0}]
[]
[null,null,null,"Total Lifetime Fuel Cost Savings:",{"$f":"E7 * Calculator!$B$7","v":0}]
[null,null,null,"Total Lifetime GHG Savings:",{"$f":"E9*Calculator!$B$7","v":0},"tCO2e"]
[null,null,null,"Total Lifetime Maintenance Savings:",{"$f":"E11*Calculator!$B$7","v":0}]
[]
{"$rows_left_out":38}
{"sheet":"PHEV_Calcs","index":5,"n_rows":32,"n_cols":14,"rows_kept":32,"cut":false,"hidden":true,"merged":[[9,1,9,3],[9,4,9,5]]}
[]
["Solve equation: $749 = Electric fuel cost x X + (Gasoline fuel cost x (1-X))"]
["X = (Annual fuel cost - Gasoline fuel cost) ÷ (Electric fuel cost - Gasoline fuel cost)"]
[]
["Kilometres per year",{"$f":"Calculator!B3","v":20000}]
["Electricity ($/kWh)",{"$f":"Calculator!B6","v":0.15}]
["Regular gasoline ($/L)",{"$f":"Calculator!B5","v":1.5}]
["Premium gasoline ($/L)",1.1000000000000001]
[]
[null,"Electric mode",null,null,"Gasoline-only",null,"Composite annual","Approx","Annual electricity","Annual gasoline","Electricity","Gasoline","Annual GHGs","Adjusted Composite annual"]
["Electric Vehicle","kWh/100 km","L/100 km","Annual fuel cost","Comb L/100 km","Annual fuel cost","fuel cost","utility factor (X)","use (kWh)","use (L)","cost","cost"," Emitted (tCO2e)","fuel cost"]
["CHEVROLET VOLT",{"$f":"Data!D3","v":19.899999999999999},0,{"$f":"ROUND((B12*$B$5/100*$B$6)+(C12*$B$5/100*$B$7),2)","v":597},5.6,{"$f":"ROUND(E12*$B$5/100*$B$7,2)","v":1680},655,{"$f":"ROUND((G12-F12)/(D12-F12),4)","v":0.94640000000000002},{"$f":"B12*$B$5/100*H12","v":3766.672},{"$f":"((E12*$B$5/100*(1-H12)))","v":60.031999999999982},{"$f":"ROUND(I12*$B$6,0)","v":565},{"$f":"ROUND(J12*$B$7,0)","v":90},{"$f":"(I12*0.00057) + (J12*0.0023)","v":2.2850766399999998},{"$f":"K12 + L12","v":655}]
["CHRYSLER PACIFICA HYBRID",{"$f":"Data!D4","v":25.8},0,{"$f":"ROUND((B13*$B$5/100*$B$6)+(C13*$B$5/100*$B$7),2)","v":774},8,{"$f":"ROUND(E13*$B$5/100*$B$7,2)","v":2400},1094,{"$f":"ROUND((G13-F13)/(D13-F13),4)","v":0.80320000000000003},{"$f":"B13*$B$5/100*H13","v":4144.5119999999997},{"$f":"((E13*$B$5/100*(1-H13)))","v":314.87999999999994},{"$f":"ROUND(I13*$B$6,0)","v":622},{"$f":"ROUND(J13*$B$7,0)","v":472},{"$f":"(I13*0.00057) + (J13*0.0023)","v":3.0865958399999998},{"$f":"K13 + L13","v":1094}]
["FORD ESCAPE PLUG-IN",{"$f":"Data!D5","v":20.2},0,606,5.8,{"$f":"ROUND(E14*$B$5/100*$B$7,2)","v":1740},795,{"$f":"ROUND((G14-F14)/(D14-F14),4)","v":0.83330000000000004},3366.5320000000002,193.37199999999996,505,290,2.3636788399999999,795]
["FORD FUSION ENERGI",{"$f":"Data!D6","v":20.5},0,615,5.6,{"$f":"ROUND(E15*$B$5/100*$B$7,2)","v":1680},957,0.67889999999999995,{"$f":"B15*$B$5/100*H15","v":2783.49},359.63200000000006,418,539,2.4137428999999999,957]
["HONDA CLARITY PLUG-IN",{"$f":"Data!D7","v":19},0,570,5.6,1680,746,0.84140000000000004,3197.32,177.63199999999995,480,266,2.231026,746]
["HYUNDAI IONIQ PLUG-IN",{"$f":"Data!D8","v":17.399999999999999},0,522,4.5,1350,684,0.80430000000000001,2798.9639999999999,176.13,420,264,2.0005084799999997,684]
["HYUNDAI SONATA PLUG-IN",{"$f":"Data!D9","v":20.9},0,627,6,{"$f":"ROUND(E18*$B$5/100*$B$7,2)","v":1800},836,0.82179999999999997,3435.1239999999998,213.84000000000003,515,321,2.4498526799999998,836]
["HYUNDAI SANTA FE PLUG-IN",{"$f":"Data!D10","v":27.5},0,{"$f":"ROUND((B19*$B$5/100*$B$6)+(C19*$B$5/100*$B$7),2)","v":825},7.2,{"$f":"ROUND(E19*$B$5/100*$B$7,2)","v":2160},1081,0.80820000000000003,4445.1000000000004,276.19199999999995,667,414,3.1689486000000002,1081]
["HYUNDAI TUCSON PLUG-IN",{"$f":"Data!D11","v":25.9},0,{"$f":"ROUND((B20*$B$5/100*$B$6)+(C20*$B$5/100*$B$7),2)","v":777},6.7,{"$f":"ROUND(E20*$B$5/100*$B$7,2)","v":2010},994,0.82399999999999995,4268.32,235.84000000000006,640,354,2.9753744000000002,994]
{"$rows_left_out":13}
{"sheet":"Passenger EV Fuel Efficiency","index":6,"n_rows":93,"n_cols":23,"rows_kept":93,"cut":false,"hidden":true,"merged":[[77,12,77,20],[78,12,79,12],[78,13,79,13],[78,15,79,15],[78,16,79,16],[78,17,79,17],[78,18,79,18],[78,19,79,19],[78,20,79,20],[74,12,74,20],[75,12,76,12],[75,13,76,13],[75,15,76,15],[75,16,76,16],[75,17,76,17],[75,18,76,18],[75,19,76,19],[75,20,76,20],[69,20,70,20],[71,12,71,20],[72,12,73,12],[72,13,73,13],[72,15,73,15],[72,16,73,16],[72,17,73,17],[72,18,73,18],[72,19,73,19],[72,20,73,20],[69,13,70,13],[69,15,70,15],[69,16,70,16],[69,17,70,17],[69,18,70,18],[69,19,70,19],[69,0,70,0],[69,3,70,3],[69,4,70,4],[69,5,70,5],[69,6,70,6],[69,12,70,12],[66,16,67,16],[66,17,67,17],[66,18,67,18],[66,19,67,19],[66,20,67,20],[68,0,68,8],[68,12,68,20],[65,0,65,8],[65,12,65,20],[66,0,67,0],[66,3,67,3],[66,4,67,4],[66,5,67,5],[66,6,67,6],[66,12,67,12],[66,13,67,13],[66,15,67,15],[63,15,64,15],[63,16,64,16],[63,17,64,17],[63,18,64,18],[63,19,64,19],[63,20,64,20],[60,20,61,20],[62,0,62,8],[62,12,62,20],[63,0,64,0],[63,3,64,3],[63,4,64,4],[63,5,64,5],[63,6,64,6],[63,12,64,12],[63,13,64,13],[60,13,61,13],[60,15,61,15],[60,16,61,16],[60,17,61,17],[60,18,61,18],[60,19,61,19],[60,0,61,0],[60,3,61,3],[60,4,61,4],[60,5,61,5],[60,6,61,6],[60,12,61,12],[57,16,58,16],[57,17,58,17],[57,18,58,18],[57,19,58,19],[57,20,58,20],[59,0,59,8],[59,12,59,20],[56,0,56,8],[56,12,56,20],[57,0,58,0],[57,3,58,3],[57,4,58,4],[57,5,58,5],[57,6,58,6],[57,12,58,12],[57,13,58,13],[57,15,58,15],[54,15,55,15],[54,16,55,16],[54,17,55,17],[54,18,55,18],[54,19,55,19],[54,20,55,20],[51,20,52,20],[53,0,53,8],[53,12,53,20],[54,0,55,0],[54,3,55,3],[54,4,55,4],[54,5,55,5],[54,6,55,6],[54,12,55,12],[54,13,55,13],[51,13,52,13],[51,15,52,15],[51,16,52,16],[51,17,52,17],[51,18,52,18],[51,19,52,19],[51,0,52,0],[51,3,52,3],[51,4,52,4],[51,5,52,5],[51,6,52,6],[51,12,52,12],[48,16,49,16],[48,17,49,17],[48,18,49,18],[48,19,49,19],[48,20,49,20],[50,0,50,8],[50,12,50,20],[47,0,47,8],[47,12,47,20],[48,0,49,0],[48,3,49,3],[48,4,49,4],[48,5,49,5],[48,6,49,6],[48,12,49,12],[48,13,49,13],[48,15,49,15],[45,15,46,15],[45,16,46,16],[45,17,46,17],[45,18,46,18],[45,19,46,19],[45,20,46,20],[42,20,43,20],[44,0,44,8],[44,12,44,20],[45,0,46,0],[45,3,46,3],[45,4,46,4],[45,5,46,5],[45,6,46,6],[45,12,46,12],[45,13,46,13],[42,13,43,13],[42,15,43,15],[42,16,43,16],[42,17,43,17],[42,18,43,18],[42,19,43,19],[42,0,43,0],[42,3,43,3],[42,4,43,4],[42,5,43,5],[42,6,43,6],[42,12,43,12],[39,16,40,16],[39,17,40,17],[39,18,40,18],[39,19,40,19],[39,20,40,20],[41,0,41,8],[41,12,41,20],[38,0,38,8],[38,12,38,20],[39,0,40,0],[39,3,40,3],[39,4,40,4],[39,5,40,5],[39,6,40,6],[39,12,40,12],[39,13,40,13],[39,15,40,15],[36,15,37,15],[36,16,37,16],[36,17,37,17],[36,18,37,18],[36,19,37,19],[36,20,37,20],[33,20,34,20],[35,0,35,8],[35,12,35,20],[36,0,37,0],[36,3,37,3],[36,4,37,4],[36,5,37,5],[36,6,37,6],[36,12,37,12],[36,13,37,13],[33,13,34,13],[33,15,34,15],[33,16,34,16],[33,17,34,17],[33,18,34,18],[33,19,34,19],[33,0,34,0],[33,3,34,3],[33,4,34,4],[33,5,34,5],[33,6,34,6],[33,12,34,12],[30,16,31,16],[30,17,31,17],[30,18,31,18],[30,19,31,19],[30,20,31,20],[32,0,32,8],[32,12,32,20],[29,0,29,8],[29,12,29,20],[30,0,31,0],[30,3,31,3],[30,4,31,4],[30,5,31,5],[30,6,31,6],[30,12,31,12],[30,13,31,13],[30,15,31,15],[26,0,26,8],[27,0,28,0],[27,3,28,3],[27,4,28,4],[27,5,28,5],[27,6,28,6],[24,15,25,15],[24,16,25,16],[24,17,25,17],[24,18,25,18],[24,19,25,19],[24,20,25,20],[21,20,22,20],[23,0,23,8],[23,12,23,20],[24,0,25,0],[24,3,25,3],[24,4,25,4],[24,5,25,5],[24,6,25,6],[24,12,25,12],[24,13,25,13],[21,13,22,13],[21,15,22,15],[21,16,22,16],[21,17,22,17],[21,18,22,18],[21,19,22,19],[21,0,22,0],[21,3,22,3],[21,4,22,4],[21,5,22,5],[21,6,22,6],[21,12,22,12],[18,16,19,16],[18,17,19,17],[18,18,19,18],[18,19,19,19],[18,20,19,20],[20,0,20,8],[20,12,20,20],[17,0,17,8],[17,12,17,20],[18,0,19,0],[18,3,19,3],[18,4,19,4],[18,5,19,5],[18,6,19,6],[18,12,19,12],[18,13,19,13],[18,15,19,15],[14,0,14,8],[15,0,16,0],[15,3,16,3],[15,4,16,4],[15,5,16,5],[15,6,16,6],[11,0,11,8],[12,0,13,0],[12,3,13,3],[12,4,13,4],[12,5,13,5],[12,6,13,6],[9,19,10,19],[9,20,10,20],[6,20,7,20],[8,0,8,8],[8,12,8,20],[9,0,10,0],[9,3,10,3],[9,4,10,4],[9,5,10,5],[9,6,10,6],[9,12,10,12],[9,13,10,13],[6,13,7,13],[6,15,7,15],[6,16,7,16],[6,17,7,17],[6,18,7,18],[6,19,7,19],[6,4,7,4],[6,6,7,6],[6,12,7,12],[3,12,4,12],[3,13,4,13],[3,15,4,15],[3,16,4,16],[3,17,4,17],[12,13,13,13],[3,18,4,18],[9,15,10,15],[9,16,10,16],[9,17,10,17],[9,18,10,18],[12,12,13,12],[12,19,13,19],[15,12,16,12],[15,13,16,13],[15,19,16,19],[15,20,16,20],[27,19,28,19],[27,20,28,20],[0,3,0,8],[0,16,0,17],[0,18,0,20],[2,0,2,8],[2,12,2,20],[3,0,4,0],[3,3,4,3],[3,4,4,4],[3,5,4,5],[3,6,4,6],[3,19,4,19],[3,20,4,20],[5,0,5,8],[5,12,5,20],[6,0,7,0],[6,3,7,3],[6,5,7,5]]}
["Plug-in hybrid electric vehicles",null,null,"Understanding the table\n",null,null,null,null,null,null,null,null,"Battery-electric vehicles",null,null,null,"Up to date as of:",null,"2019-02-25"]
["Make ModelSpecificationsFootnote1","Fuel\ntype","Combined Le/100 km\nCity/Hwy/Comb L/100 km","$/yr","CO2\n(g/km)","CO2\nrating","Smog\nrating","Range\n(km)","Recharge\ntime (h)","Price ($ USD)","Price ($ CAD)",null,"Make ModelSpecifications2","Fuel\ntype","City/Hwy/Comb kWh/100 km\nCity/Hwy/Comb Le/100 km","$/yr","CO2\n(g/km)","CO2\nrating","Smog\nrating","Range\n(km)","Recharge\ntime (h)","Price ($ USD)","Price ($ CAD)"]
["BMW 530e",null,null,null,null,null,null,null,null,null,null,null,"BMW i3 (120 Ah)"]
["C, 83 kW, 2.0 L,\n4 cyl, AS8","B/Z*","3.3 (28.5 kWh/100 km + 0.0 L/100 km)",1464,120,10,7,26,2,null,null,null,"S, 125 kW, A1","B","16.8 / 20.6 / 18.5",481,0,10,10,246,7,44450,57987]
[null,"Z","8.6 / 7.7 / 8.2",null,null,null,null,560,"-",null,null,null,null,null,"1.9 / 2.3 / 2.1"]
["BMW 530e xDRIVE",null,null,null,null,null,null,null,null,null,null,null,"BMW i3s (120 Ah)"]
["C, 83 kW, 2.0 L,\n4 cyl, AS8","B/Z*","3.5 (30.2 kWh/100 km + 0.0 L/100 km)",1511,124,10,7,24,2,53400,69663,null,"S, 125 kW, A1","B","16.8 / 20.6 / 18.5",481,0,10,10,246,7]
[null,"Z","8.8 / 7.7 / 8.3",null,null,null,null,554,"-",null,null,null,null,null,"1.9 / 2.3 / 2.1"]
["BMW 740e xDRIVE",null,null,null,null,null,null,null,null,null,null,null,"CHEVROLET BOLT EV"]
["L, 83 kW, 2.0 L,\n4 cyl, AS8","B/Z*","3.6 (32.1 kWh/100 km + 0.0 L/100 km)",1616,133,9,3,23,3,null,null,null,"WS, 150 kW, A1","B","16.4 / 19.0 / 17.6",458,0,10,10,383,9.3000000000000007,36620,47773]
[null,"Z","9.5 / 8.0 / 8.8",null,null,null,null,525,"-",null,null,null,null,null,"1.8 / 2.1 / 2.0"]
["BMW i3 REx (120 Ah)",null,null,null,null,null,null,null,null,null,null,null,"FIAT 500e"]
["S, 125 kW, 0.6 L,\n2 cyl, A1","B/Z*","2.4 (19.9 kWh/100 km)",644,14,10,7,203,7,48300,63010,null,"S, 24 kW, A1","B","121/103/ 112",null,null,null,null,135,null,32995,43044]
[null,"Z","7.8 / 7.5 / 7.7",null,null,null,null,116,"-"]
["BMW i3s REx",null,null,null,null,null,null,null,null,null,null,null,"HONDA CLARITY"]
["S, 135 kW, 0.6 L,\n2 cyl, A1","B/Z*","2.4 (19.9 kWh/100 km)",644,14,10,7,203,7,48300,63010,null,"120 kW","B","16.5 / 20 / 18.5",null,null,null,null,143,3.5,199,260]
[null,"Z","7.8 / 7.5 / 7.7",null,null,null,null,116,"-",null,null,null,null,null,"1.9 / 2.3 / 2.1",null,null,null,null,null,null,"(Lease Only)","(Lease Only)"]
["BMW i8 COUPE",null,null,null,null,null,null,null,null,null,null,null,"HYUNDAI IONIQ ELECTRIC"]
["S, 105 kW, 1.5 L,\n3 cyl, AS6","B/Z*","3.4 (30.6 kWh/100 km + 0.0 L/100 km)",1512,118,10,3,29,3,147500,192421,null,"M, 88 kW, A1","B","13.7 / 17.4 / 15.5",403,0,10,10,200,4,30315,39547]
[null,"Z","9.2 / 8.0 / 8.7",null,null,null,null,488,"-",null,null,null,null,null,"1.6 / 1.9 / 1.7"]
{"$rows_left_out":73}